{"text_format":"3","workbook":"xlsx","n_sheets":2,"sheets":["全省助产机构一览表","Sheet1"],"not_rendered":{"defined_names":1},"read":"whole","date_system":"1900"}

{"sheet":"全省助产机构一览表","index":0,"n_rows":1489,"n_cols":8,"rows_kept":1489,"merged":[[0,0,0,7],[2,1,118,1],[119,1,189,1],[190,1,215,1],[216,1,269,1],[270,1,320,1],[321,1,383,1],[384,1,428,1],[429,1,552,1],[553,1,640,1],[641,1,680,1],[681,1,750,1],[751,1,777,1],[778,1,852,1],[853,1,901,1],[902,1,1003,1],[1004,1,1137,1],[1138,1,1251,1],[1252,1,1321,1],[1322,1,1355,1],[1356,1,1449,1],[1450,1,1488,1]]}
["广东省助产机构信息一览表（2024年）"]
["序号","地市","县（区）","助产机构名称","地址","是否开设产科门诊\n（是/暂停）","是否提供住院分娩助产服务\n（是/暂停）","联系电话（加区号）"]
[1,"广州市","越秀区","广州医科大学附属妇女儿童医疗中心越秀院区","广州市人民中路402","是","是","020-81330376"]
[2,null,"越秀区","中国人民解放军南部战区总医院","广州市流花路111号","是","是","020-88686664"]
[3,null,"越秀区","中国人民解放军南部战区空军医院","广州市东风东路801号","是","是","020-88639810"]
[4,null,"越秀区","广州医科大学附属第一医院","广州市沿江路151号","是","是","020-83062004"]
[5,null,"越秀区","广东省人民医院","广州市中山二路106号","是","是","020-83843720"]
[6,null,"越秀区","广州市第一人民医院","广州市盘福路1号","是","是","020-81048911"]
[7,null,"越秀区","中山大学附属第一医院","广州市中山二路58号","是","是","020-87338951"]
[8,null,"越秀区","中山大学孙逸仙纪念医院","广州市沿江西路107号","是","是","020-81332505"]
[9,null,"越秀区","广州市越秀区妇幼保健院","广州市越华路50号、东皋大道6号、水荫路110号","是","是","020-83186715"]
[10,null,"越秀区","广东省妇幼保健院越秀院区","广州市广园西路13号","是","是","020-86505157"]
[11,null,"越秀区","广东药科大学附属第一医院","广州市农林下路19号","是","是","020-61321187"]
[12,null,"海珠区","广州医科大学附属第二医院","广州市昌岗东路250号","是","是","020-34152432（产科门诊）"]
[13,null,"海珠区","广东省第二人民医院","海珠区新港中路466号大院","是","是","020-89168089"]
[14,null,"海珠区","广州市海珠区妇幼保健院","广州市海珠区江南西路杏园大街15号、海珠区南田路302号","是","是","产科门诊：020-84414539，产科病房：020-84421891"]
[15,null,"海珠区","广州新海医院","广州市海珠区新港西路167号","是","是","020-84105050（产科病房）"]
[16,null,"海珠区","中国人民解放军陆军第七十四集团军医院","广州市海珠区新港中路468号","是","是","020-88636751（产科门诊）"]
[17,null,"海珠区","南方医科大学珠江医院","广州市工业大道中253号","是","是","020-62782970"]
[18,null,"海珠区","广州市红十字会医院","广州市同福中路396号","是","是","020-61883927"]
[19,null,"海珠区","广州和睦家医院","广州市海珠区琶洲大道31号","是","是","24小时呼叫热线：4008919191"]
[20,null,"荔湾区","广州医科大学附属第三医院","荔湾区多宝路63号","是","是","020-81292086"]
[21,null,"荔湾区","广州市荔湾区妇幼保健院","广州市荔湾区东漖南路238号、荔湾区浣花东路墩兴西街1号（荔湾区儿童公园南门侧）","是","是","020-81744220"]
[22,null,"荔湾区","广州市荔湾中心医院","荔湾路35号","是","是","020-81346937"]
[23,null,"荔湾区","广州市荔湾区人民医院","广州市荔湾区明心路3号","是","是","020-81805529"]
[24,null,"荔湾区","伊丽莎白妇产医院","广州市荔湾区康王中路484号","是","是","020-81329999"]
[25,null,"天河区","中山大学附属第三医院","广州市天河区天河路600号","是","是","020-85252706；020-85252236"]
[26,null,"天河区","中山大学附属第六医院","广州市天河区员村二横路26号","是","是","020-38379722"]
[27,null,"天河区","广东省妇幼保健院天河院区","广州市天河区沙太南路163号","是","是","020-39139989"]
[28,null,"天河区","暨南大学附属第一医院","广州黄埔大道西613号、天河区车陂北街22号之一、中山大道245号","是","是","020-38688226、020-38688105"]
[29,null,"天河区","南方医科大学第三附属医院","广州市天河区中山大道183号","是","是","020-62784249"]
[30,null,"天河区","武警广东省总队医院","广州市天河区燕岭路268号","是","是","020-61627277"]
[31,null,"天河区","广州医科大学附属妇女儿童医疗中心天河院区","广州市金穗路9号","是","是","020-38076461"]
[32,null,"天河区","广州市第十二人民医院","广州市天河区黄埔大道西天强路1号","是","是","020-38665756"]
[33,null,"天河区","广州市天河区妇幼保健院","广州市天河北路367号","是","是","020-38823670"]
[34,null,"天河区","广州市天河区人民医院","广州市天河区东圃大马路13号","是","是","020-82308194转8074"]
[35,null,"天河区","广州爱博恩妇产医院","广州市天河区龙口东路2、4、6号自编0333号","是","是","020-36663663"]
[36,null,"天河区","广州天河龙洞医院","广州市天河区龙洞村龙洞东路二横路2号","是","是","020-87051245"]
[37,null,"白云区","南方医科大学南方医院","广州大道北1838号","是","是","020-62786824"]
[38,null,"白云区","广州中医药大学第一附属医院","机场路14号、16号","是","是","020-36591342"]
{"$rows_left_out":1450}
{"sheet":"Sheet1","index":1,"n_rows":135,"n_cols":35,"rows_kept":135,"merged":[[5,0,6,0],[5,1,6,1],[5,2,6,2],[10,6,11,6],[10,7,11,7],[10,8,11,8],[10,9,11,9],[10,10,11,10],[10,11,11,11],[14,24,15,24],[14,26,15,26],[14,27,15,27],[14,28,15,28],[14,29,15,29],[17,23,18,23],[17,24,18,24],[17,25,18,25],[17,26,18,26],[17,27,18,27],[17,28,18,28],[21,23,22,23],[21,24,22,24],[21,25,22,25],[21,26,22,26],[21,27,22,27],[21,28,22,28],[22,6,23,6],[22,7,23,7],[22,8,23,8],[22,9,23,9],[22,10,23,10],[26,23,27,23],[26,24,27,24],[26,25,27,25],[26,26,27,26],[26,27,27,27],[26,28,27,28],[26,29,27,29],[31,31,32,31],[31,33,32,33],[31,34,32,34],[33,32,34,32],[33,33,34,33],[33,34,34,34],[41,24,42,24],[41,25,42,25],[41,26,42,26],[41,27,42,27],[41,28,42,28],[41,29,42,29],[42,31,43,31],[42,33,43,33],[42,34,43,34],[48,6,49,6],[48,7,49,7],[48,8,49,8],[48,9,49,9],[48,10,49,10],[48,24,50,24],[48,25,50,25],[48,26,50,26],[48,27,50,27],[48,28,50,28],[48,29,50,29],[53,24,54,24],[53,25,54,25],[53,26,54,26],[53,27,54,27],[53,28,54,28],[53,29,54,29],[63,23,64,23],[63,24,64,24],[63,26,64,26],[63,27,64,27],[63,28,64,28],[63,29,64,29],[87,24,88,24],[87,26,88,26],[87,27,88,27],[87,28,88,28],[87,29,88,29],[89,26,90,26],[89,27,90,27],[89,28,90,28],[89,29,90,29],[91,24,92,24],[91,25,92,25],[91,26,92,26],[91,27,92,27],[91,28,92,28],[91,29,92,29],[93,24,94,24],[93,25,94,25],[93,26,94,26],[93,27,94,27],[93,28,94,28],[97,6,98,6],[97,7,98,7],[97,8,98,8],[97,9,98,9],[97,10,98,10],[97,24,98,24],[97,26,98,26],[97,27,98,27],[97,28,98,28],[97,29,98,29],[99,24,100,24],[99,25,100,25],[99,26,100,26],[99,27,100,27],[99,28,100,28],[99,29,100,29],[102,6,103,6],[102,7,103,7],[102,8,103,8],[102,10,103,10],[102,11,103,11],[102,24,103,24],[102,25,103,25],[102,26,103,26],[102,27,103,27],[102,28,103,28],[102,29,103,29],[104,24,105,24],[104,25,105,25],[104,26,105,26],[104,27,105,27],[104,28,105,28],[104,29,105,29],[106,24,107,24],[106,25,107,25],[106,26,107,26],[106,27,107,27],[106,28,107,28],[106,29,107,29],[121,23,122,23],[121,24,122,24],[121,25,122,25],[121,26,122,26],[121,27,122,27],[121,29,122,29]]}
[1,2,3,{"$nulls":3},1,2,3,4,5,6,"核查",null,null,1,2,3,4,5,{"$nulls":3},1,2,3,4,5,6,7]
["东莞市人民医院","东莞市万江街道万道路78号（红楼院区）","0769-23281111",{"$nulls":3},"肇庆市第二人民医院 肇庆市妇幼保健院（肇庆市妇幼保健计划生育服务中心）","广东省肇庆市端州区建设二路2号","12441200456488227W","是","是","0758-2701552",{"$f":"VLOOKUP(G2,全省助产机构一览表!D:F,3,FALSE)","v":"是"},null,null,"揭阳市人民医院","揭阳市榕城区天福路107号","是","是","0663-8645629",{"$nulls":3},"广州医科大学附属妇女儿童医疗中心越秀院区","广州市人民中路402",1.24401006832921e+17,"是","是","Ⅴ类","020-81330376",null,"汕头市妇幼保健院","汕头市金平区中平街15号",1.24405004559423e+17,"0754-88549342"]
["东莞市妇幼保健院","东莞市东城区主山社区振兴路99号（总院）","0769-23329880",{"$nulls":3},"肇庆市第一人民医院","肇庆市端州区东岗东路9号","1244120045648850X0","是","是","0758-2102301",{"$f":"VLOOKUP(G3,全省助产机构一览表!D:F,3,FALSE)","v":"是"},null,null,"揭阳市慈云医院","揭阳市区淡浦路以东美阳路以南","是","是","0663-8920106",{"$nulls":3},"中国人民解放军南部战区总医院","广州市流花路111号","A1100000MK0054378K","是","是","Ⅴ类","020-88686664",null,"汕头市中心医院","广东省汕头市外马路114号","12440500455942045W","0754-88903477"]
["东莞市莞城医院","东莞市莞城区莞太路78号","0769-23038606",{"$nulls":3},"肇庆市端州区妇幼保健院","肇庆市端州区宝月路27号","12441202456488104Q","是","是","0758-2261034",{"$f":"VLOOKUP(G4,全省助产机构一览表!D:F,3,FALSE)","v":"是"},null,null,"揭阳市妇幼保健院","揭阳市榕城区新河路西建阳路北","是","是","0663-8211861",{"$nulls":3},"中国人民解放军南部战区空军医院","广州市东风东路801号","A1100000MK0053340G","是","是","Ⅳ类","020-88639810",null,"汕头市第二人民医院","汕头市外马路28号","12440500455941907T","0754-88412800"]
["东莞市东部中心医院","东莞市常平镇常东路88号","0769-83912333",{"$nulls":3},"肇庆市端州区人民医院","肇庆市端州区城北路69号",1.24412024564886e+17,"是","是","0758-2293103",{"$f":"VLOOKUP(G5,全省助产机构一览表!D:F,3,FALSE)","v":"是"},null,null,"揭阳市榕城区妇幼保健计划生育服务中心","揭阳市榕城区天福东路","是","是","0663-8692031",{"$nulls":3},"广州医科大学附属第一医院","广州市沿江路151号","12440100455344205E","是","是","Ⅴ类","020-83062004",null,"汕头大学医学院第一附属医院","广东省汕头市金平区长平路57号；东厦路52号一楼、二楼、三楼；东厦路62号三层南侧；庐山北路35号1-7层","12440000455860736B","0754-88905000"]
["东莞市中堂医院","东莞市中堂镇中麻公路东向路段","0769-88123217",{"$nulls":3},"肇庆市端州区黄岗社区卫生服务中心","肇庆市端州区端州一路",1.24412024564878e+17,"是","否（暂停时间2022年11月15日）","0758-2745078",{"$f":"VLOOKUP(G6,全省助产机构一览表!D:F,3,FALSE)","v":"是"},null,null,"揭阳安真妇产医院","揭阳市榕城区马牙大道与临江北路交汇处","是","是","0663-8205555",{"$nulls":3},"广东省人民医院","广州市中山二路106号","12440000455861990H","是","是","Ⅴ类","020-83843720",null,"汕头大学医学院第二附属医院","广东省汕头市东厦路北段；东厦花园三期2、3、4栋1、2楼",1.24400004558607e+17,"0754-88915666"]
[{"$nulls":6},"肇庆市鼎湖区中医院","肇庆市鼎湖区广利街道街道办事处利民路27号","12441203456490474D","是","否（暂停时间2023年12月1日至2024年11月30日）","0758-2684010",{"$f":"VLOOKUP(G7,全省助产机构一览表!D:F,3,FALSE)","v":"是"},null,null,"揭阳市榕城区中心医院","揭阳市榕城区七号街以东二号路以南","是","是","0663-8498512",{"$nulls":3},"广州市第一人民医院","广州市盘福路1号","1244010045535063XD","是","是","Ⅴ类","020-81048911",null,"汕头市金平区人民医院","汕头市金平区金园路21号","12440511455942838G","0754-86509036"]
["东莞市望牛墩医院","广东省东莞市望牛墩镇望联康盛路1号","0769-88851861",{"$nulls":3},"肇庆市鼎湖区人民医院","广东省肇庆市鼎湖区桂城街道平安西街4号","12441203456489713E","是","是","0758-2691915",{"$f":"VLOOKUP(G8,全省助产机构一览表!D:F,3,FALSE)","v":"是"},null,null,"揭阳市榕城区人民医院","揭阳市榕城区西马路25号","否（2023年7月1日）","否（2023年7月1日）","0663-8622391",{"$nulls":3},"中山大学附属第一医院","广州市中山二路58号","12100000455416029H","是","是","Ⅴ类","020-87338951",null,"汕头市金平区妇幼保健院","汕头市金平区金新路109号","12440511455942782D","0754-88605736"]
["东莞市水乡中心医院","东莞市麻涌镇文化广场北侧","0769-88827013",{"$nulls":3},"中山大学附属第三医院肇庆医院","肇庆市鼎湖区肇庆新区砚阳路1号","1244 1200 MB2C637862","是","是","0758-2672987",{"$f":"VLOOKUP(G9,全省助产机构一览表!D:F,3,FALSE)","v":"是"},null,null,"揭阳市榕城区仙桥社区卫生服务中心","揭阳市榕城区仙桥榕池路","是","否（2021年7月）","0663-8868120",{"$nulls":3},"中山大学孙逸仙纪念医院","广州市沿江西路107号","12100000455416037C","是","是","Ⅴ类","020-81332505",null,"汕头市金平区中医医院","汕头市金平区广厦新城天山北路葵花园葵花综合楼","12440511455942774J","0754-81880641"]
["东莞市虎门医院","东莞市虎门镇则徐路145号","0769-85523533",{"$nulls":3},"肇庆市鼎湖区莲花镇卫生院","肇庆市鼎湖区莲花镇开发区321国道旁","12441203456489692X","是","是","0758-2611120",{"$f":"VLOOKUP(G10,全省助产机构一览表!D:F,3,FALSE)","v":"是"},null,null,"揭阳市榕城区渔湖街道社区卫生服务中心","揭阳市榕城区望江北路与发展大道交叉口东南侧150米","是","是","0663-8775055",{"$nulls":3},"广州市越秀区妇幼保健院","广州市越华路50号、东皋大道6号、水荫路110号","12440104455364177F","是","是","Ⅳ类","020-83186715",null,"汕头市金平区鮀浦医院","汕头市金平区普宁路38号","12440511455946660C","0754-82530536"]
["东莞市沙田医院","东莞市沙田镇中心区站前路","0769-88800588",{"$nulls":3},"肇庆市鼎湖区永安镇卫生院","肇庆市鼎湖区永安镇永华街32号",1.24412034564897e+17,"是","是","0758-2661213",{"$f":"VLOOKUP(G11,全省助产机构一览表!D:F,3,FALSE)","v":"是"},null,null,"揭阳市榕城区砲台镇中心卫生院","揭阳市榕城区砲台镇涵华中路220号","是","是","0663-3839666",{"$nulls":3},"广东省妇幼保健院越秀院区","广州市广园西路13号","12440000455861907X","是","是","Ⅴ类","020-86505157",null,"汕头市中医医院","龙湖区韶山路3号","12440500455941982K","0754-87272276"]
["东莞市石排医院","东莞市石排镇石排大道中198号","0769-86556333",{"$nulls":9},{"$f":"VLOOKUP(G12,全省助产机构一览表!D:F,3,FALSE)","v":{"$error":"#N/A"}},null,null,"揭阳市榕城区登岗镇卫生院","揭阳市榕城区登岗镇许畔村","是","是","0663-3381248",{"$nulls":3},"广东药科大学附属第一医院","广州市农林下路19号",1.24400004573267e+17,"是","是","Ⅴ类","020-61321187",null,"汕头市龙湖人民医院","汕头市龙湖区金霞街道榕江路18号","12440507455945561R","0754-87279100"]
["东莞市石碣医院","东莞市石碣镇崇焕西路35号","0769-86631092",{"$nulls":3},"肇庆市高要区妇幼保健计划生育服务中心（区妇幼保健院、区妇女儿童医院）","高要区南岸街道南兴二路5号","12441283456509681A","是","是","0758-8393832",{"$f":"VLOOKUP(G13,全省助产机构一览表!D:F,3,FALSE)","v":"是"},null,null,"揭阳市榕城区地都镇卫生院","揭阳市榕城区地都镇","是","是","0663-3313120",{"$nulls":3},"广州医科大学附属第二医院","广州市昌岗东路250号",1.24401004553442e+17,"是","是","Ⅴ类","020-34152432（产科门诊）",null,"龙湖区第二人民医院","汕头市嵩山路71号","12440507455946310D","0754-83966853"]
["东莞市凤岗医院","东莞市凤岗镇凤平路13号","0769-82856611",{"$nulls":3},"肇庆市高要区中医院","高要区南岸街道府前大街33号","12441283456509075K","是","是","0758-8392836",{"$f":"VLOOKUP(G14,全省助产机构一览表!D:F,3,FALSE)","v":"是"},null,null,"揭阳雅安医院","揭阳市空港经济区砲台镇丰溪村李厝","是","是","0663-8170329",{"$nulls":3},"广东省第二人民医院","海珠区新港中路466号大院","1244000072549786XN","是","是","Ⅴ类","020-89168089",null,"龙湖区第三人民医院","汕头市龙湖区鸥汀街道证果寺路27号","12440507455944198L","0754-88330358"]
["东莞市东坑医院","东莞市东坑镇沿河西二路41号","0769-83382018",{"$nulls":3},"肇庆市高要区人民医院","1-肇庆市天宁北路72号/2-肇庆市高要区南岸街道湖西一路17号","12441283456509120L","是","是","总院0758-2290389分院  0758-8208393",{"$f":"VLOOKUP(G15,全省助产机构一览表!D:F,3,FALSE)","v":"是"},null,null,"国裕医院","广东省揭阳市榕城区进贤门大道东","是","是","0663-3663393",{"$nulls":4},"广州市海珠区江南西路杏园大街15号、海珠区南田路302号",null,"是","是","Ⅳ类","产科门诊：020-84414539，产科病房：020-84421891",null,"新溪社区医院","龙湖区新文路东侧","'124405074559639977","0754-86206683"]
["东莞市横沥医院","东莞市横沥镇天桥路205号","0769-83726631",{"$nulls":3},"肇庆市高要区小湘镇卫生院","高要区小湘镇文明街28号","12441283707982941T","是","是","0758-8289817",{"$f":"VLOOKUP(G16,全省助产机构一览表!D:F,3,FALSE)","v":"是"},null,null,"揭阳浩泽医院","揭阳市榕城区砲台镇青溪仔206国道南侧","是","是","0663-3350722",{"$nulls":3},"广州市海珠区妇幼保健院",null,"12440105455370710Y",{"$nulls":5},"外砂社区医院","龙华街道迎宾北路西侧","12440507455963962L","0754-86162325"]
["东莞市黄江医院","广东省东莞市黄江镇富民南路810号","0769-83636326",{"$nulls":3},"肇庆市高要区白诸镇卫生院","高要区白诸镇广南街3号","1244128345650977XM","是","是","0758-8417183",{"$f":"VLOOKUP(G17,全省助产机构一览表!D:F,3,FALSE)","v":"是"},null,null,"惠来县人民医院","惠来县惠西路230号","是","是","0663-6681414",{"$nulls":3},"广州新海医院","广州市海珠区新港西路167号","12440000455416280U","是","是","III类","020-84105050（产科病房）",null,"汕头龙湖天佑医院","汕头市龙湖区金霞街道华山路28号","9144050735124527X5","0754-88857408"]
["东莞市虎门中医院","东莞市虎门镇捷南路375号","0769-85713423",{"$nulls":3},"肇庆市高要区金利中心卫生院","高要区金利镇城北路1号",1.24412834565101e+17,"是","是","0758-8571936",{"$f":"VLOOKUP(G18,全省助产机构一览表!D:F,3,FALSE)","v":"是"},null,null,"惠来县慈云中医院","惠来县惠城镇南门东路99号","是","是","0663-6685879",{"$nulls":3},"中国人民解放军陆军第七十四集团军医院","广州市海珠区新港中路468号","A1100000MK00506927","是","是","Ⅴ类","020-88636751（产科门诊）",null,"汕头妇产医院","汕头市龙湖区珠池路15号","'914405076924376673","0754-86111111"]
["东莞市长安镇乌沙医院","东莞市长安镇乌沙村李屋大道","0769-85538120",{"$nulls":3},"肇庆市高要区南岸街道马安社区卫生服务中心","马安新城区幸福路8号",1.24412837079829e+17,"是","否（暂停时间2013年）","0758-8311237",{"$f":"VLOOKUP(G19,全省助产机构一览表!D:F,3,FALSE)","v":"是"},null,null,"惠来县妇幼保健院","惠来县新兴街4、6号","是","是","0663-6686245",{"$nulls":9},"020-88636376（产科病房）",null,"汕头市第三人民医院","汕头市濠江区礐石街道海旁路12号","12440500455942993Y","0754-87493833"]
["东莞市虎门镇北栅医院","东莞市虎门镇北栅村S358省道旁","0769-85551854",{"$nulls":3},"肇庆市高要区南岸街道社区卫生服务中心","南岸街道文峰路16号","12441283456510009F","是","否（暂停时间2014年）","0758-8393331",{"$f":"VLOOKUP(G20,全省助产机构一览表!D:F,3,FALSE)","v":"是"},null,null,"惠来县东陇镇卫生院","惠来县东陇镇华强路","是","是","0663-6552344",{"$nulls":3},"南方医科大学珠江医院","广州市工业大道中253号",1.24400007256275e+17,"是","是","Ⅴ类","020-62782970",null,"汕头市濠江区妇幼保健计划生育服务中心","汕头市濠江区府前路赤港崩坑洋粮食局综合大楼","12440512MB2C00574T","0754-87372086"]
["东莞广济医院","东莞市凤岗镇雁田镇田北路","0769-88786633",{"$nulls":3},"肇庆市高要区乐城中心卫生院","乐城镇新街92号","12441283456509112R","是","是","0758-8226237",{"$f":"VLOOKUP(G21,全省助产机构一览表!D:F,3,FALSE)","v":"是"},null,null,"惠来县岐石镇卫生院","惠来县岐石镇岐石管区五片","是","是","0663-6312156",{"$nulls":3},"广州市红十字会医院","广州市同福中路396号",1.24401004553506e+17,"是","是","Ⅴ类","020-61883927",null,"汕头市濠江区人民医院","汕头市濠江区府前路西堆水库旁","12440512455945529M","0754-87383015"]
["东莞市第八人民医院（东莞市儿童医院）","东莞市石龙镇西湖三路(南)68号","0769-86119611",{"$nulls":3},"肇庆市高要区禄步中心卫生院","高要区禄步镇江头沙41号","12441283456509147C","是","是","0758-8255970",{"$f":"VLOOKUP(G22,全省助产机构一览表!D:F,3,FALSE)","v":"是"},null,null,"惠来县葵潭镇中心卫生院","惠来县葵潭镇龙华街68号","是","是","0663-6262513",{"$nulls":3},"广州和睦家医院","广州市海珠区琶洲大道31号","91440101MA59F3JF84","是","是","III类","24小时呼叫热线：4008919191",null,"珠浦医院","汕头市濠江区珠浦管理区","12440512455945510Q","0754-89695536"]
["东莞市厚街医院","东莞市厚街镇河田大道","0769-85588409",{"$nulls":3},"肇庆市高要区新桥中心卫生院","新桥镇联兴路80号","12441283456509649Y","是","是","0758-8473833",{"$f":"VLOOKUP(G23,全省助产机构一览表!D:F,3,FALSE)","v":"是"},null,null,"惠来县鳌江镇卫生院","惠来县鳌江镇沃上村","是","是","0663-6290205",{"$nulls":9},"分娩热线：020-36102313",null,"汕头市澄海区人民医院","汕头市澄海区澄城镇环北路、汕头市澄海区澄华街道澄华路北侧、怀汉路西面","12440515455964076Q","0754-85725345"]
["东莞市茶山医院","东莞市茶山镇彩虹路92号","0769-86642066",{"$nulls":8},"0758-8473120",{"$f":"VLOOKUP(G24,全省助产机构一览表!D:F,3,FALSE)","v":{"$error":"#N/A"}},null,null,"惠来坤宁医院","惠来县隆江镇葵和公路旁","是","是","0663-6282233",{"$nulls":3},"广州医科大学附属第三医院","荔湾区多宝路63号","12440100455350648D","是","是","Ⅴ类","020-81292086",null,"汕头市澄海区妇幼保健院","汕头市澄海区中山路12号","12440515455964156C","0754-85722456"]
["东莞市谢岗医院","东莞市谢岗镇站前路3号","0769-87686028",{"$nulls":3},"肇庆高要金利博爱医院","高要区金利镇金龙大道","91441283576403662P","是","是","0758-8580699",{"$f":"VLOOKUP(G25,全省助产机构一览表!D:F,3,FALSE)","v":"是"},null,null,"惠来荣康医院","惠来县惠城镇惠西路","是","是","0663-6693408",{"$nulls":3},"广州市荔湾区妇幼保健院","广州市荔湾区东漖南路238号、荔湾区浣花东路墩兴西街1号（荔湾区儿童公园南门侧）","12440103455379846E","是","是","Ⅳ类","020-81744220",null,"汕头市澄海区澄华街道社区卫生服务中心","汕头市澄海区北门直街","12440515455964009T","0754-85723003"]
["东莞市万江医院","东莞市万江街道莞穗路万江段100号","0769-28823233",{"$nulls":3},"肇庆市高要区河台镇卫生院","河台镇府前大街65号",1.244128345651e+17,"是","是","0758-8218300",{"$f":"VLOOKUP(G26,全省助产机构一览表!D:F,3,FALSE)","v":"是"},null,null,"惠来县仙庵镇卫生院","仙庵镇葵华北公路旁","是","是","0663-6786060",{"$nulls":3},"广州市荔湾中心医院","荔湾路35号","12440103455359976P","是","是","Ⅳ类","020-81346937",null,"汕头市澄海区东里中心卫生院","汕头市澄海区东里镇樟西路","12440515455963954C","0754-85751651"]
["东莞市道滘医院","东莞市道滘镇北永金牛新村","0769-88831185",{"$nulls":3},"肇庆市高要区活道镇卫生院","高要区活道镇镇中路13号",1.24412834565098e+17,"是","是","0758-8432091",{"$f":"VLOOKUP(G27,全省助产机构一览表!D:F,3,FALSE)","v":"是"},null,null,"隆江镇中心卫生院（惠来县第二人民医院）","广东省揭阳市惠来县隆江镇葵和路黄洋路口","是","是","0663-6340151",{"$nulls":3},"广州市荔湾区人民医院","广州市荔湾区明心路3号","12440103455379811U","是","是","Ⅳ类","020-81805529",null,"汕头市澄海区隆都中心卫生院","汕头市澄海区隆都镇店市","12440515455964025G","0754-85782004"]
["东莞市东城医院","东莞市南城路56号、东莞市东城区立新光大花园银河路38号","0769-22213790",{"$nulls":3},"肇庆市高要区水南镇卫生院","高要区水南镇正东街30号",1.24412834565091e+17,"是","是","0758-8235313",{"$f":"VLOOKUP(G28,全省助产机构一览表!D:F,3,FALSE)","v":"是"},null,null,"惠来县周田镇卫生院","惠来县周田镇考山村大山坑尾","是","是","0663-6828229",{"$nulls":11},"汕头市澄海区莲下中心卫生院","汕头市澄海区莲下镇槐泽灰堤头",1.2440515455964e+17,"0754-85741297"]
["东莞市大朗医院","东莞市大朗镇金朗中路85号","0769-83198700",{"$nulls":3},"肇庆市高要区蛟塘镇卫生院","高要区蛟塘镇双桥路47号","12441283456509083E","是","是","0758-8113998",{"$f":"VLOOKUP(G29,全省助产机构一览表!D:F,3,FALSE)","v":"是"},null,null,"惠来真爱医院","揭阳市惠来县惠城镇东华路西第四幢1号","是","是","0663-6586999",{"$nulls":3},"伊丽莎白妇产医院","广州市荔湾区康王中路484号","91440101569764507Y","是","是","Ⅱ类","020-81329999",null,"汕头市澄海区上华镇卫生院","汕头市澄海区上华镇下陈澄江路旁",1.24405154573239e+17,"0754-85709256"]
["东莞市长安医院","东莞市长安镇长青路","0769-85339219",{"$nulls":3},"肇庆市高要区莲塘镇卫生院","高要区莲塘镇公信路4号","12441283456510017A","是","是","0758-8454305",{"$f":"VLOOKUP(G30,全省助产机构一览表!D:F,3,FALSE)","v":"是"},null,null,"惠来县惠城镇卫生院","惠来县惠城镇环城西路117号","是","是","0663-6617236",{"$nulls":3},"中山大学附属第三医院","广州市天河区天河路600号",1.2100000455416e+17,"是","是","Ⅴ类"," 020-85252706；020-85252236",null,"汕头澄海港立医院","汕头市澄海区鸿发广场宁鸿楼（上埭区间路1号）","91440515597462792M","0754-85691197"]
["东莞市滨海湾中心医院","东莞市虎门镇虎门大道111号","0769-88213111",{"$nulls":3},"肇庆市高要区蚬岗镇卫生院","高要区蚬岗镇圣岗街","12441283456509139H","是","是","0758-8558225",{"$f":"VLOOKUP(G31,全省助产机构一览表!D:F,3,FALSE)","v":"是"},null,null,"溪西镇卫生院","溪西镇溪一村","是","是","0663-6390500",{"$nulls":3},"中山大学附属第六医院","广州市天河区员村二横路26号","12440000455350680K","是","是","Ⅴ类","020-38379722",null,"汕头市潮阳区贵屿镇卫生院","汕头市潮阳区贵屿镇新乡村竹竿坽庵后延伸至237省道旁","12440513455960083N","0754-84454100"]
["东莞市清溪医院","东莞市清溪镇香芒中路5号、东莞市清溪镇大利村银瓶路、东莞市清溪镇清凤路三中村","0769-38828820",{"$nulls":3},"肇庆市高要区大湾镇卫生院","高要区大湾镇窦头街78号",1.2441283456509e+17,"是","是","0758-8139232",{"$f":"VLOOKUP(G32,全省助产机构一览表!D:F,3,FALSE)","v":"是"},null,null,"惠来县靖海镇中心卫生院","惠来县靖海镇西丰管区","否","是","0663-6860145",{"$nulls":3},"广东省妇幼保健院天河院区","广州市天河区沙太南路163号","12440000455861907X","是","是","Ⅴ类","020-39139989",null,"潮阳宏济医院","汕头市潮阳区棉城旷园","52440513MJL5387727","0754-83614999"]
["东莞市樟木头医院","东莞市樟木头镇银河北路15号","0769-87709268",{"$nulls":3},"肇庆市高要区白土中心卫生院","白土镇兴德西路","12441283456509067Q","是","是","0758-8174967",{"$f":"VLOOKUP(G33,全省助产机构一览表!D:F,3,FALSE)","v":"是"},null,null,"惠来县前詹镇卫生院","惠来县前詹镇","是","否（2020年暂停）",{"$nulls":4},"暨南大学附属第一医院","广州黄埔大道西613号、天河区车陂北街22号之一、中山大道245号",1.21000004554144e+17,"是","是","Ⅴ类","020-38688226、020-38688105",null,null,"广汕公路交警大队东侧"]
["广东医科大学附属东莞第一医院（东莞市东南部中心医院）","广东省东莞市塘厦镇蛟坪路42号","0769-89190557",{"$nulls":3},"肇庆市高要区回龙镇卫生院","高要区回龙镇中心大街","12441283456510121E","是","是","0758-8152362",{"$f":"VLOOKUP(G34,全省助产机构一览表!D:F,3,FALSE)","v":"是"},null,null,"东港镇卫生院","东港镇东港村东新大街6号","否","否（2021年暂停）",{"$nulls":4},"南方医科大学第三附属医院","广州市天河区中山大道183号","12440000455862491F","是","是","Ⅴ类"," 020-62784249",null,"汕头市潮阳区","汕头市潮阳区西胪镇西一居委沟北洋坊","12440513455960032E","0754-83301519"]
["东莞市高埗医院","东莞市高埗镇创兴中路2号","0769-81136001",{"$nulls":3},"肇庆市高要区金渡镇卫生院","高要区金渡镇金沙路38号",1.244128345651e+17,"是","是","0758-8518037",{"$f":"VLOOKUP(G35,全省助产机构一览表!D:F,3,FALSE)","v":"是"},null,null,"惠来县神泉镇卫生院","惠来县神泉镇东风路7号","否","否（2019年暂停）",{"$nulls":4},"武警广东省总队医院","广州市天河区燕岭路268号",1.24401006832921e+17,"是","是","Ⅴ类","020-61627277",null,"西胪镇卫生院"]
["东莞市企石医院","东莞市企石镇宝华路115号","0769-86726633",{"$nulls":3},"四会市妇幼保健院","四会市东城区四会大道北133座",1.24412847148661e+17,"是","是","0758-3303985",{"$f":"VLOOKUP(G36,全省助产机构一览表!D:F,3,FALSE)","v":"是"},null,null,"揭西县人民医院","广东省揭阳市揭西县河婆街道党校路7号","是","是","0663-5584382",{"$nulls":3},"广州医科大学附属妇女儿童医疗中心天河院区","广州市金穗路9号",1.24401006832921e+17,"是","是","Ⅴ类","020-38076461",null,"汕头星光妇产医院","汕头市潮阳区和平镇星光路口","91440513MA51GKYA7P","0754-82266333"]
["东莞市中医院","东莞市东城街道松山湖大道东城段3号","0769-22238348",{"$nulls":3},"四会市中医院","四会市东城区水仙路4号","12441284456526203R","是","是","0758-3395662",{"$f":"VLOOKUP(G37,全省助产机构一览表!D:F,3,FALSE)","v":"是"},null,null,"揭西县妇幼保健计划生育服务中心","揭阳市揭西县河婆街道宝塔居委新丰路88号","是","是","0663-5530392",{"$nulls":3},"广州市第十二人民医院","广州市天河区黄埔大道西天强路1号",1.24401004553507e+17,"是","是","Ⅳ类"," 020-38665756",null,"汕头市潮阳区铜盂镇卫生院","汕头市潮阳区铜盂镇环南路",1.24405134559603e+17,"0754-87595273"]
["东莞市桥头医院","东莞市桥头镇工业路43号","0769-81037832",{"$nulls":3},"四会市人民医院","旧院区：前进路3号  新院区：（东城街道黄岗居委会商业大道55号）",1.24412844565263e+17,"是（两院区都开设产科门诊）","是（分娩业务在东城院区）","0758-3152113",{"$f":"VLOOKUP(G38,全省助产机构一览表!D:F,3,FALSE)","v":"是（两院区都开设产科门诊）"},null,null,"揭西县棉湖华侨医院","揭西县棉湖镇洪棉路旁135号","是","是","0663-5255600",{"$nulls":3},"广州市天河区妇幼保健院","广州市天河北路367号","12440106455374690W","是","是","Ⅳ类"," 020-38823670",null,"汕头市潮阳区妇幼保健院","汕头市潮阳区棉北街道东山大道平北路段","12440513455960307U","0754-88720604"]
["东莞市松山湖中心医院","东莞市石龙镇黄洲祥龙路1号","0769-81368800",{"$nulls":3},"四会万隆医院","四会市城中区朝阳街6号",9.14412847331348e+17,"是","是","0758-3389609",{"$f":"VLOOKUP(G39,全省助产机构一览表!D:F,3,FALSE)","v":"是"},null,null,"揭西县中医医院","揭西县京溪园镇长滩村新洪村老虎径地段","是","是","0663-5851795",{"$nulls":3},"广州市天河区人民医院","广州市天河区东圃大马路13号","12440106G34098209B","是","是","Ⅳ类"," 020-82308194转8074",null,"汕头市潮阳区关埠镇中心卫生院","汕头市潮阳区关埠镇港底开发区旁","'124405134559600409","0754-83372403"]
["东莞市寮步医院","东莞市寮步镇寮城西路107号","0769-83325111",{"$nulls":3},"四会市迳口镇卫生院","四会市迳口镇墟","12441284456526035P","否(暂停时间：2012年7月)","否（暂停时间：2018年10月）","0758-3718378",{"$f":"VLOOKUP(G40,全省助产机构一览表!D:F,3,FALSE)","v":{"$error":"#N/A"}},null,null,"揭西县大溪镇卫生院","揭阳市揭西县大溪镇华阳大道","是","是","0663-5811670",{"$nulls":3},"广州爱博恩妇产医院","广州市天河区龙口东路2、4、6号自编0333号",9.14401013047761e+17,"是","是","Ⅳ类"," 020-36663663",null,"汕头市潮阳区人民医院","汕头市潮阳区棉城柳园路86号","12440513455960323H","0754-83617011"]
{"$rows_left_out":95}